Target
Melanocortin receptor 3
Ligand
BDBM50131260
Substrate
Meas. Tech.
ChEMBL_106017 (CHEMBL718189)
Ki
140±n/a nM
Citation
 Koikov, LNEbetino, FHSolinsky, MGCross-Doersen, DKnittel, JJ Sub-nanomolar hMC1R agonists by end-capping of the melanocortin tetrapeptide His-D-Phe-Arg-Trp-NH(2). Bioorg Med Chem Lett 13:2647-50 (2003)  
Target
Name:
Melanocortin receptor 3
Synonyms:
MC3-R MC3R_HUMAN Melanocortin receptor (M3 and M4)
Type:
Enzyme
Mol. Mass.:
36044.86
Organism:
Homo sapiens (Human)
Description:
P41968
Residue:
323
  
Inhibitor
Name:
BDBM50131260
Synonyms:
(D)-(S)-5-Guanidino-2-{(S)-2-[(S)-2-(2-hydroxy-3-phenyl-propionylamino)-3-(3H-imidazol-4-yl)-propionylamino]-3-phenyl-propionylamino}-pentanoic acid [(S)-1-carbamoyl-2-(1H-indol-3-yl)-ethyl]-amide | CHEMBL312998
Type:
Small organic molecule
Emp. Form.:
C41H49N11O6
Mol. Mass.:
791.8979
SMILES:
NC(=N)NCCC[C@H](NC(=O)[C@H](Cc1ccccc1)NC(=O)[C@H](Cc1cnc[nH]1)NC(=O)C(O)Cc1ccccc1)C(=O)N[C@@H](Cc1c[nH]c2ccccc12)C(N)=O
: