Target
Prothrombin
Ligand
BDBM50131471
Substrate
Meas. Tech.
ChEBML_208517
Ki
0.060000±n/a nM
Citation
 Nantermet, PGBarrow, JCNewton, CLPellicore, JMYoung, MLewis, SDLucas, BJKrueger, JAMcMasters, DRYan, YKuo, LCVacca, JPSelnick, HG Design and synthesis of potent and selective macrocyclic thrombin inhibitors. Bioorg Med Chem Lett 13:2781-4 (2003)  
Target
Name:
Prothrombin
Synonyms:
Activation peptide fragment 1 Coagulation factor II Prothrombin precursor Thrombin heavy chain | Thrombin light chain
Type:
Protein
Mol. Mass.:
70029.57
Organism:
Homo sapiens (Human)
Description:
P00734
Residue:
622
  
Inhibitor
Name:
BDBM50131471
Synonyms:
(14Z,21S)-21-benzyl-8,26-dichloro-12,17-dioxa-1,4,19,22,24-pentaazatricyclo[21.3.1.0^{6,11}]heptacosa-6(11),7,9,14,23,25-hexaene-3,18,27-trione | CHEMBL94952
Type:
Small organic molecule
Emp. Form.:
C27H27Cl2N5O5
Mol. Mass.:
572.44
SMILES:
Clc1ccc2OC\C=C/COC(=O)NC[C@H](Cc3ccccc3)Nc3ncc(Cl)n(CC(=O)NCc2c1)c3=O
: