Target
Carbonic anhydrase 2
Ligand
BDBM50135622
Substrate
Meas. Tech.
ChEBML_45085
Ki
2.4±n/a nM
Citation
 Casini, AScozzafava, AMincione, FMenabuoni, LStarnotti, MSupuran, CT Carbonic anhydrase inhibitors: topically acting antiglaucoma sulfonamides incorporating esters and amides of 3- and 4-carboxybenzolamide. Bioorg Med Chem Lett 13:2867-73 (2003)  
Target
Name:
Carbonic anhydrase 2
Synonyms:
CA-II CAC Carbonate dehydratase II Carbonic anhydrase 2 (CA-II) Carbonic anhydrase C Carbonic anhydrase II (CA-II) Carbonic anhydrase II (hCA II) | Carbonic anhydrase isoenzyme II (hCA II)
Type:
Enzyme
Mol. Mass.:
29250.71
Organism:
Homo sapiens (Human)
Description:
P00918
Residue:
260
  
Inhibitor
Name:
BDBM50135622
Synonyms:
4-[3-Methyl-5-sulfamoyl-3H-[1,3,4]thiadiazol-(2E)-ylidenesulfamoyl]-benzoic acid 2-dimethylamino-ethyl ester | CHEMBL328648
Type:
Small organic molecule
Emp. Form.:
C14H19N5O6S3
Mol. Mass.:
449.526
SMILES:
CN(C)CCOC(=O)c1ccc(cc1)S(=O)(=O)\N=c1\sc(nn1C)S(N)(=O)=O
: