Target
Carbonic anhydrase 2
Ligand
BDBM50135626
Substrate
Meas. Tech.
ChEBML_45085
Ki
2.1±n/a nM
Citation
 Casini, AScozzafava, AMincione, FMenabuoni, LStarnotti, MSupuran, CT Carbonic anhydrase inhibitors: topically acting antiglaucoma sulfonamides incorporating esters and amides of 3- and 4-carboxybenzolamide. Bioorg Med Chem Lett 13:2867-73 (2003)  
Target
Name:
Carbonic anhydrase 2
Synonyms:
CA-II CAC Carbonate dehydratase II Carbonic anhydrase 2 (CA-II) Carbonic anhydrase C Carbonic anhydrase II (CA-II) Carbonic anhydrase II (hCA II) | Carbonic anhydrase isoenzyme II (hCA II)
Type:
Enzyme
Mol. Mass.:
29250.71
Organism:
Homo sapiens (Human)
Description:
P00918
Residue:
260
  
Inhibitor
Name:
BDBM50135626
Synonyms:
3-(5-Sulfamoyl-[1,3,4]thiadiazol-2-ylsulfamoyl)-benzoic acid 2-dimethylamino-ethyl ester | CHEMBL100266
Type:
Small organic molecule
Emp. Form.:
C13H17N5O6S3
Mol. Mass.:
435.499
SMILES:
CN(C)CCOC(=O)c1cccc(c1)S(=O)(=O)Nc1nnc(s1)S(N)(=O)=O
: