Target
Coagulation factor X
Ligand
BDBM50124862
Substrate
Meas. Tech.
ChEBML_69660
Kd
17000±n/a nM
Citation
 Gunnarsson, GTDesai, UR Exploring new non-sugar sulfated molecules as activators of antithrombin. Bioorg Med Chem Lett 13:679-83 (2003)  
Target
Name:
Coagulation factor X
Synonyms:
Activated coagulation factor X (FXa) Coagulation factor X precursor F10 Factor X heavy chain Factor Xa Stuart-Prower factor
Type:
Enzyme
Mol. Mass.:
54726.60
Organism:
Homo sapiens (Human)
Description:
Residue:
488
  
Inhibitor
Name:
BDBM50124862
Synonyms:
2-[3,4-bis(sulfonatooxy)phenyl]-4-oxo-3,5-bis(sulfonatooxy)-3,4-dihydro-2H-chromen-7-yl sulfate
Type:
Small organic molecule
Emp. Form.:
C15H5O22S5
Mol. Mass.:
697.515
SMILES:
[O-]S(=O)(=O)Oc1cc(OS([O-])(=O)=O)c2c(c1)oc(-c1ccc(OS([O-])(=O)=O)c(OS([O-])(=O)=O)c1)c(OS([O-])(=O)=O)c2=O
: