Target
Nociceptin receptor
Ligand
BDBM50137565
Substrate
Meas. Tech.
ChEMBL_144650 (CHEMBL752664)
EC50
65±n/a nM
Citation
 Jong, LZaveri, NToll, L The design and synthesis of a novel quinolizidine template for potent opioid and opioid receptor-like (ORL1, NOP) receptor ligands. Bioorg Med Chem Lett 14:181-5 (2003)  
Target
Name:
Nociceptin receptor
Synonyms:
KOR-3 Mu-type opioid receptor (Mu) Nociceptin Receptor (ORL1 Receptor) Nociceptin receptor (ORL-1) Nociceptin/Orphanin FQ, NOP receptor OPIATE ORL-1 OPRL1 protein ORL1 Opioid receptor like-1 Orphanin FQ receptor (ORL1) | P41146
Type:
G Protein-Coupled Receptor (GPCR)
Mol. Mass.:
40702.87
Organism:
Homo sapiens (Human)
Description:
P41146
Residue:
370
  
Inhibitor
Name:
BDBM50137565
Synonyms:
1-((2R,6S,9aR)-6-Phenyl-octahydro-quinolizin-2-yl)-1,3-dihydro-benzoimidazol-2-one SR-14136
Type:
Small organic molecule
Emp. Form.:
C22H25N3O
Mol. Mass.:
347.4534
SMILES:
O=c1[nH]c2ccccc2n1[C@@H]1CCN2[C@H](CCC[C@H]2c2ccccc2)C1
: