Target
Mu-type opioid receptor
Ligand
BDBM50137567
Substrate
Meas. Tech.
ChEMBL_145580 (CHEMBL749656)
EC50
>10000±n/a nM
Citation
 Jong, LZaveri, NToll, L The design and synthesis of a novel quinolizidine template for potent opioid and opioid receptor-like (ORL1, NOP) receptor ligands. Bioorg Med Chem Lett 14:181-5 (2003)  
Target
Name:
Mu-type opioid receptor
Synonyms:
M-OR-1 MOR-1 MUOR1 Mu opiate receptor OPRM1 hMOP | mu-type opioid receptor isoform MOR-1
Type:
G Protein-Coupled Receptor (GPCR)
Mol. Mass.:
44789.51
Organism:
Homo sapiens (Human)
Description:
P35372
Residue:
400
  
Inhibitor
Name:
BDBM50137567
Synonyms:
1-((2R,6S,9aR)-6-Cyclohexyl-octahydro-quinolizin-2-yl)-1,3-dihydro-benzoimidazol-2-one SR-14140
Type:
Small organic molecule
Emp. Form.:
C22H31N3O
Mol. Mass.:
353.501
SMILES:
O=c1[nH]c2ccccc2n1[C@@H]1CCN2[C@H](CCC[C@H]2C2CCCCC2)C1
: