Target
Kappa-type opioid receptor
Ligand
BDBM50137566
Substrate
Meas. Tech.
ChEMBL_147232 (CHEMBL754920)
EC50
210±n/a nM
Citation
 Jong, LZaveri, NToll, L The design and synthesis of a novel quinolizidine template for potent opioid and opioid receptor-like (ORL1, NOP) receptor ligands. Bioorg Med Chem Lett 14:181-5 (2003)  
Target
Name:
Kappa-type opioid receptor
Synonyms:
K-OR-1 Kappa-opioid receptor (KOR) Kappa-type opioid receptor (KOR) OPIATE Kappa OPRK1 kappa opioid receptor (KOR)
Type:
G Protein-Coupled Receptor (GPCR)
Mol. Mass.:
42648.76
Organism:
Homo sapiens (Human)
Description:
P41145
Residue:
380
  
Inhibitor
Name:
BDBM50137566
Synonyms:
1-Ethyl-3-((2R,6S,9aR)-6-phenyl-octahydro-quinolizin-2-yl)-1,3-dihydro-benzoimidazol-2-one SR-14138
Type:
Small organic molecule
Emp. Form.:
C24H29N3O
Mol. Mass.:
375.5066
SMILES:
CCn1c2ccccc2n([C@@H]2CCN3[C@H](CCC[C@H]3c3ccccc3)C2)c1=O
: