Target
Mu-type opioid receptor
Ligand
BDBM50137563
Substrate
Meas. Tech.
ChEBML_148102
Ki
18±n/a nM
Citation
 Jong, LZaveri, NToll, L The design and synthesis of a novel quinolizidine template for potent opioid and opioid receptor-like (ORL1, NOP) receptor ligands. Bioorg Med Chem Lett 14:181-5 (2003)  
Target
Name:
Mu-type opioid receptor
Synonyms:
M-OR-1 MOR-1 MUOR1 Mu opiate receptor OPRM1 hMOP | mu-type opioid receptor isoform MOR-1
Type:
G Protein-Coupled Receptor (GPCR)
Mol. Mass.:
44789.51
Organism:
Homo sapiens (Human)
Description:
P35372
Residue:
400
  
Inhibitor
Name:
BDBM50137563
Synonyms:
1-Ethyl-3-((2S,6S,9aR)-6-phenyl-octahydro-quinolizin-2-yl)-1,3-dihydro-benzoimidazol-2-one SR-14137
Type:
Small organic molecule
Emp. Form.:
C24H29N3O
Mol. Mass.:
375.5066
SMILES:
CCn1c2ccccc2n([C@H]2CCN3[C@H](CCC[C@H]3c3ccccc3)C2)c1=O
: