Target
Carbonic anhydrase 2
Ligand
BDBM50094392
Substrate
Meas. Tech.
ChEBML_44862
Ki
1.5±n/a nM
Citation
 Abbate, FCasini, AOwa, TScozzafava, ASupuran, CT Carbonic anhydrase inhibitors: E7070, a sulfonamide anticancer agent, potently inhibits cytosolic isozymes I and II, and transmembrane, tumor-associated isozyme IX. Bioorg Med Chem Lett 14:217-23 (2003)  
Target
Name:
Carbonic anhydrase 2
Synonyms:
CA-II CAC Carbonate dehydratase II Carbonic anhydrase 2 (CA-II) Carbonic anhydrase C Carbonic anhydrase II (CA-II) Carbonic anhydrase II (hCA II) | Carbonic anhydrase isoenzyme II (hCA II)
Type:
Enzyme
Mol. Mass.:
29250.71
Organism:
Homo sapiens (Human)
Description:
P00918
Residue:
260
  
Inhibitor
Name:
BDBM50094392
Synonyms:
2,3,4,5,6-Pentafluoro-N-(3-methyl-5-sulfamoyl-3H-[1,3,4]thiadiazol-2-ylidene)-benzamide CHEMBL69149
Type:
Small organic molecule
Emp. Form.:
C10H5F5N4O3S2
Mol. Mass.:
388.294
SMILES:
Cn1nc(s\c1=N\C(=O)c1c(F)c(F)c(F)c(F)c1F)S(N)(=O)=O
: