Target
5-hydroxytryptamine receptor 1B
Ligand
BDBM50145349
Substrate
Meas. Tech.
ChEBML_1343
Ki
>1000±n/a nM
Citation
 Timms, GHBoot, JRBroadmore, RJCarney, SLCooper, JFindlay, JDGilmore, JMitchell, SMoore, NAPullar, ISanger, GJTomlinson, RTree, BBWedley, S SAR development of a selective 5-HT1D antagonist/serotonin reuptake inhibitor lead using rapid parallel synthesis. Bioorg Med Chem Lett 14:2469-72 (2004)  
Target
Name:
5-hydroxytryptamine receptor 1B
Synonyms:
5-HT-1B 5-HT1B 5HT1B_HUMAN HTR1DB Serotonin (5-HT) receptor Serotonin Receptor 1B
Type:
G Protein-Coupled Receptor (GPCR)
Mol. Mass.:
43579.17
Organism:
Homo sapiens (Human)
Description:
Receptor binding assays were performed using human clone stably expressed in CHO cells
Residue:
390
  
Inhibitor
Name:
BDBM50145349
Synonyms:
1-{2-[4-(7-Fluoro-1H-indol-3-yl)-3,6-dihydro-2H-pyridin-1-yl]-ethyl}-isochroman-6-carboxylic acid amide | CHEMBL83112
Type:
Small organic molecule
Emp. Form.:
C25H26FN3O2
Mol. Mass.:
419.4912
SMILES:
NC(=O)c1ccc2C(CCN3CCC(=CC3)c3c[nH]c4c(F)cccc34)OCCc2c1
: