Target
Vasopressin V2 receptor
Ligand
BDBM50146293
Substrate
Meas. Tech.
ChEMBL_214260 (CHEMBL818586)
Ki
6±n/a nM
Citation
 Matthews, JMHoekstra, WJDyatkin, ABHecker, LRHlasta, DJPoulter, BLAndrade-Gordon, Pde Garavilla, LDemarest, KTEricson, EGunnet, JWHageman, WLook, RMoore, JBReynolds, CHMaryanoff, BE Potent nonpeptide vasopressin receptor antagonists based on oxazino- and thiazinobenzodiazepine templates. Bioorg Med Chem Lett 14:2747-52 (2004)  
Target
Name:
Vasopressin V2 receptor
Synonyms:
ADHR AVPR2 DIR Renal-type arginine vasopressin receptor V2R_HUMAN Vasopressin V2 receptor | Vasopressin receptor
Type:
Receptor
Mol. Mass.:
40295.28
Organism:
Homo sapiens (Human)
Description:
P30518
Residue:
371
  
Inhibitor
Name:
BDBM50146293
Synonyms:
5-Hydroxy-biphenyl-2-carboxylic acid [3-chloro-4-((S)-3,4,11,11a-tetrahydro-1H,5H-2-oxa-4a,10-diaza-dibenzo[a,d]cycloheptene-10-carbonyl)-phenyl]-amide | CHEMBL327242
Type:
Small organic molecule
Emp. Form.:
C32H28ClN3O4
Mol. Mass.:
554.035
SMILES:
Oc1ccc(C(=O)Nc2ccc(C(=O)N3C[C@H]4COCCN4Cc4ccccc34)c(Cl)c2)c(c1)-c1ccccc1
: