Target
Cholecystokinin receptor type A
Ligand
BDBM50092405
Substrate
Meas. Tech.
ChEBML_49723
Ki
0.750000±n/a nM
Citation
 Bellier, BDugave, CEtivant, FGenet, RGigoux, VGarbay, C Synthesis and biological characterisation of [3H]BBL454, a new CCK2 selective radiolabelled agonist displaying original pharmacological properties. Bioorg Med Chem Lett 14:369-72 (2003)  
Target
Name:
Cholecystokinin receptor type A
Synonyms:
CCK-A receptor CCK1-R CCKAR_CAVPO Cholecystokinin receptor type A | Cholecystokinin-1 receptor
Type:
Mol. Mass.:
48229.77
Organism:
Cavia porcellus
Description:
Residue:
430
  
Inhibitor
Name:
BDBM50092405
Synonyms:
(S)-N-((S)-1-Carbamoyl-2-phenyl-ethyl)-3-((S)-2-{[(S)-2-(2-carboxy-acetylamino)-3-(1H-indol-3-yl)-propionyl]-methyl-amino}-hexanoylamino)-succinamic acid N-(1-Carbamoyl-2-phenyl-ethyl)-3-(2-{[2-(2-carboxy-acetylamino)-3-(1H-indol-3-yl)-propionyl]-methyl-amino}-hexanoylamino)-succinamic acid
Type:
Small organic molecule
Emp. Form.:
C34H42N6O9
Mol. Mass.:
678.7321
SMILES:
CCCC[C@H](N(C)C(=O)[C@H](Cc1c[nH]c2ccccc12)NC(=O)CC(O)=O)C(=O)N[C@@H](CC(O)=O)C(=O)N[C@@H](Cc1ccccc1)C(N)=O
: