Target
Equilibrative nucleoside transporter 1
Ligand
BDBM50366956
Substrate
Meas. Tech.
ChEBML_216398
Ki
16±n/a nM
Citation
 Gupte, ABuolamwini, JK Novel halogenated nitrobenzylthioinosine analogs as es nucleoside transporter inhibitors. Bioorg Med Chem Lett 14:2257-60 (2004)  
Target
Name:
Equilibrative nucleoside transporter 1
Synonyms:
ENT1 Equilibrative Nucleoside Transporter 1 (ENT1) Equilibrative nucleoside transporter 1 S29A1_HUMAN Solute carrier family 29 member 1
Type:
Multi-pass membrane protein
Mol. Mass.:
50225.92
Organism:
Homo sapiens (Human)
Description:
Residue:
456
  
Inhibitor
Name:
BDBM50366956
Synonyms:
BDBM50413730 CHEMBL610940
Type:
Small organic molecule
Emp. Form.:
C17H17ClN4O4S
Mol. Mass.:
408.859
SMILES:
OC[C@H]1O[C@H]([C@H](O)[C@@H]1O)n1cnc2c(SCc3cccc(Cl)c3)ncnc12
: