Target
Aldehyde oxidase
Ligand
BDBM50366982
Substrate
Meas. Tech.
ChEBML_31305
Ki
200000±n/a nM
Citation
 Cates, LAJones, GSGood, DJTsai, HYLi, VSCaron, NTu, SCKimball, AP Cyclophosphamide potentiation and aldehyde oxidase inhibition by phosphorylated aldehydes and acetals. J Med Chem 23:300-4 (1980)  
Target
Name:
Aldehyde oxidase
Synonyms:
AO AOXA_HUMAN | Aldehyde oxidase
Type:
PROTEIN
Mol. Mass.:
147930.97
Organism:
Homo sapiens (Human)
Description:
ChEMBL_1481150
Residue:
1338
  
Inhibitor
Name:
BDBM50366982
Synonyms:
CHEMBL316980
Type:
Small organic molecule
Emp. Form.:
C7H15O4P
Mol. Mass.:
194.1654
SMILES:
CCOP(=O)(CCC=O)OCC
: