Target
Adenylate kinase 2, mitochondrial
Ligand
BDBM50367040
Substrate
Meas. Tech.
ChEMBL_32051 (CHEMBL644151)
Ki
10000±n/a nM
Citation
 Kappler, FHai, TTAbo, MHampton, A Species- or isozyme-specific enzyme inhibitors. 8. Synthesis of disubstituted two-substrate condensation products as inhibitors of rat adenylate kinases. J Med Chem 25:1179-84 (1983)  
Target
Name:
Adenylate kinase 2, mitochondrial
Synonyms:
2.7.4.3 ATP-AMP transphosphorylase 2 Adenylate kinase 2 Adenylate monophosphate kinase KAD2_RAT
Type:
Mol. Mass.:
26380.21
Organism:
Rattus norvegicus
Description:
Residue:
239
  
Inhibitor
Name:
BDBM50367040
Synonyms:
CHEMBL606017
Type:
Small organic molecule
Emp. Form.:
C24H37N10O22P5S2
Mol. Mass.:
1036.603
SMILES:
CCSc1nc2c(N)ncnc2n1C1O[C@H](COP(O)(=O)OP(O)(=O)OP(O)(=O)OP(O)(=O)OP(O)(=O)OC[C@H]2OC([C@H](O)[C@@H]2O)n2c(SCC)nc3c(N)ncnc23)[C@@H](O)[C@H]1O
: