Target
Adenylate kinase 2, mitochondrial
Ligand
BDBM50367045
Substrate
Meas. Tech.
ChEMBL_32052 (CHEMBL873039)
Ki
3200000±n/a nM
Citation
 Kappler, FHai, TTAbo, MHampton, A Species- or isozyme-specific enzyme inhibitors. 8. Synthesis of disubstituted two-substrate condensation products as inhibitors of rat adenylate kinases. J Med Chem 25:1179-84 (1983)  
Target
Name:
Adenylate kinase 2, mitochondrial
Synonyms:
2.7.4.3 ATP-AMP transphosphorylase 2 Adenylate kinase 2 Adenylate monophosphate kinase KAD2_RAT
Type:
Mol. Mass.:
26380.21
Organism:
Rattus norvegicus
Description:
Residue:
239
  
Inhibitor
Name:
BDBM50367045
Synonyms:
CHEMBL605010
Type:
Small organic molecule
Emp. Form.:
C13H20N5O7P
Mol. Mass.:
389.301
SMILES:
CCC[C@@H](OP(O)(O)=O)[C@H]1OC([C@H](O)[C@@H]1O)n1cnc2c(N)ncnc12
: