Target
Delta-type opioid receptor
Ligand
BDBM50027507
Substrate
Meas. Tech.
ChEMBL_146768 (CHEMBL755212)
IC50
221±n/a nM
Citation
 DiMaio, JNguyen, TMLemieux, CSchiller, PW Synthesis and pharmacological characterization in vitro of cyclic enkephalin analogues: effect of conformational constraints on opiate receptor selectivity. J Med Chem 25:1432-8 (1983)  
Target
Name:
Delta-type opioid receptor
Synonyms:
Cytochrome P450 3A4 Delta opioid receptor Delta-type opioid receptor (DOR) OPRD_RAT Opioid receptor Opioid receptors; mu & delta Ror-a | Voltage-gated potassium channel
Type:
G Protein-Coupled Receptor (GPCR)
Mol. Mass.:
40465.04
Organism:
Rattus norvegicus (rat)
Description:
Competition binding assays were using CHO-K1 cell membranes expressing the opioid receptor.
Residue:
372
  
Inhibitor
Name:
BDBM50027507
Synonyms:
Acetate1-(6-benzyl-3-isobutyl-2,5,8,11-tetraoxo-1,4,7,10tetraaza-cyclopentadec-12-ylcarbamoyl)-2-(4-hydroxy-phenyl)-ethyl-ammonium; | CHEMBL2372201
Type:
Small organic molecule
Emp. Form.:
C33H46N6O8
Mol. Mass.:
654.7537
SMILES:
CC(O)=O.CC(C)C[C@@H]1NC(=O)[C@H](Cc2ccccc2)NC(=O)CNC(=O)[C@@H](CCCNC1=O)NC(=O)[C@@H](N)Cc1ccc(O)cc1
: