Target
S-adenosylmethionine decarboxylase proenzyme
Ligand
BDBM28441
Substrate
Meas. Tech.
ChEMBL_197049 (CHEMBL806288)
Ki
380000±n/a nM
Citation
 Kolb, MDanzin, CBarth, JClaverie, N Synthesis and biochemical properties of chemically stable product analogues of the reaction catalyzed by S-adenosyl-L-methionine decarboxylase. J Med Chem 25:550-6 (1982)  
Target
Name:
S-adenosylmethionine decarboxylase proenzyme
Synonyms:
Amd1 S-adenosylmethionine decarboxylase 1
Type:
PROTEIN
Mol. Mass.:
38134.93
Organism:
Rattus norvegicus
Description:
ChEMBL_197052
Residue:
333
  
Inhibitor
Name:
BDBM28441
Synonyms:
(2R,3R,4S,5R)-2-(6-amino-9H-purin-9-yl)-5-{[(3-aminopropyl)(methyl)amino]methyl}oxolane-3,4-diol | AdoMet substrate analogue, 18d
Type:
Small organic molecule
Emp. Form.:
C14H23N7O3
Mol. Mass.:
337.3775
SMILES:
CN(CCCN)C[C@H]1O[C@H]([C@H](O)[C@@H]1O)n1cnc2c(N)ncnc12
: