Target
Adenylate kinase isoenzyme 1
Ligand
BDBM50027446
Substrate
Meas. Tech.
ChEBML_32222
Ki
4500000±n/a nM
Citation
 Hai, TTPicker, DAbo, MHampton, A Species- or isozyme-specific enzyme inhibitors. 7. Selective effects in inhibitions of rat adenylate kinase isozymes by adenosine 5'-phosphate derivatives. J Med Chem 25:806-12 (1982)  
Target
Name:
Adenylate kinase isoenzyme 1
Synonyms:
Adenylate kinase 1 KAD1_RAT
Type:
PROTEIN
Mol. Mass.:
21585.03
Organism:
Rattus norvegicus
Description:
ChEMBL_29909
Residue:
194
  
Inhibitor
Name:
BDBM50027446
Synonyms:
CHEMBL3143582 | Phosphoric acid mono-[6-(6-amino-purin-9-yl)-2-methyl-tetrahydro-furo[3,4-d][1,3]dioxol-4-ylmethyl] ester
Type:
Small organic molecule
Emp. Form.:
C12H16N5O7P
Mol. Mass.:
373.2585
SMILES:
CC1O[C@@H]2[C@@H](COP(O)(O)=O)O[C@H]([C@@H]2O1)n1cnc2c(N)ncnc12
: