Target
GTP:AMP phosphotransferase AK3, mitochondrial
Ligand
BDBM50367098
Substrate
Meas. Tech.
ChEMBL_32216 (CHEMBL649601)
Ki
1800000±n/a nM
Citation
 Hai, TTPicker, DAbo, MHampton, A Species- or isozyme-specific enzyme inhibitors. 7. Selective effects in inhibitions of rat adenylate kinase isozymes by adenosine 5'-phosphate derivatives. J Med Chem 25:806-12 (1982)  
Target
Name:
GTP:AMP phosphotransferase AK3, mitochondrial
Synonyms:
AK 3 Adenylate kinase 3 alpha like 1 Ak3 Akl3l KAD3_RAT
Type:
PROTEIN
Mol. Mass.:
25443.58
Organism:
Rattus norvegicus
Description:
ChEMBL_1340551
Residue:
227
  
Inhibitor
Name:
BDBM50367098
Synonyms:
CHEMBL607630
Type:
Small organic molecule
Emp. Form.:
C13H20N5O7P
Mol. Mass.:
389.301
SMILES:
CCC[C@H](OP(O)(O)=O)[C@H]1OC([C@H](O)[C@@H]1O)n1cnc2c(N)ncnc12
: