Target
Adenylate kinase isoenzyme 1
Ligand
BDBM50367108
Substrate
Meas. Tech.
ChEBML_32222
Ki
5700000±n/a nM
Citation
 Hai, TTPicker, DAbo, MHampton, A Species- or isozyme-specific enzyme inhibitors. 7. Selective effects in inhibitions of rat adenylate kinase isozymes by adenosine 5'-phosphate derivatives. J Med Chem 25:806-12 (1982)  
Target
Name:
Adenylate kinase isoenzyme 1
Synonyms:
Adenylate kinase 1 KAD1_RAT
Type:
PROTEIN
Mol. Mass.:
21585.03
Organism:
Rattus norvegicus
Description:
ChEMBL_29909
Residue:
194
  
Inhibitor
Name:
BDBM50367108
Synonyms:
CHEMBL1625734 | CHEMBL607918
Type:
Small organic molecule
Emp. Form.:
C10H13N5O7S
Mol. Mass.:
347.305
SMILES:
Nc1ncnc2n(cnc12)[C@@H]1O[C@H](COS(O)(=O)=O)[C@@H](O)[C@H]1O
: