Target
Adenylate kinase isoenzyme 1
Ligand
BDBM50367098
Substrate
Meas. Tech.
ChEBML_32222
Ki
1400000±n/a nM
Citation
 Hai, TTPicker, DAbo, MHampton, A Species- or isozyme-specific enzyme inhibitors. 7. Selective effects in inhibitions of rat adenylate kinase isozymes by adenosine 5'-phosphate derivatives. J Med Chem 25:806-12 (1982)  
Target
Name:
Adenylate kinase isoenzyme 1
Synonyms:
Adenylate kinase 1 KAD1_RAT
Type:
PROTEIN
Mol. Mass.:
21585.03
Organism:
Rattus norvegicus
Description:
ChEMBL_29909
Residue:
194
  
Inhibitor
Name:
BDBM50367098
Synonyms:
CHEMBL607630
Type:
Small organic molecule
Emp. Form.:
C13H20N5O7P
Mol. Mass.:
389.301
SMILES:
CCC[C@H](OP(O)(O)=O)[C@H]1OC([C@H](O)[C@@H]1O)n1cnc2c(N)ncnc12
: