Target
Delta-type opioid receptor
Ligand
BDBM50027091
Substrate
Meas. Tech.
ChEMBL_146641 (CHEMBL754925)
EC50
50±n/a nM
Citation
 Burke, TRBajwa, BSJacobson, AERice, KCStreaty, RAKlee, WA Probes for narcotic receptor mediated phenomena. 7. Synthesis and pharmacological properties of irreversible ligands specific for mu or delta opiate receptors. J Med Chem 27:1570-4 (1985)  
Target
Name:
Delta-type opioid receptor
Synonyms:
Cytochrome P450 3A4 Delta opioid receptor Delta-type opioid receptor (DOR) OPRD_RAT Opioid receptor Opioid receptors; mu & delta Ror-a | Voltage-gated potassium channel
Type:
G Protein-Coupled Receptor (GPCR)
Mol. Mass.:
40465.04
Organism:
Rattus norvegicus (rat)
Description:
Competition binding assays were using CHO-K1 cell membranes expressing the opioid receptor.
Residue:
372
  
Inhibitor
Name:
BDBM50027091
Synonyms:
19-isothiocyanato-15-methoxy-3-methyl-13-oxa-3-azahexacyclo[13.2.2.12,8.01,6.06,14.07,12]icosa-7,9,11,16-tetraen-11-ol
Type:
Small organic molecule
Emp. Form.:
C21H22N2O3S
Mol. Mass.:
382.476
SMILES:
CO[C@]12C=C[C@@]3(C[C@@H]1N=C=S)C1Cc4ccc(O)c5O[C@@H]2C3(CCN1C)c45
: