Target
Adenosine deaminase
Ligand
BDBM82055
Substrate
Meas. Tech.
ChEBML_30786
Ki
360000±n/a nM
Citation
 Antonini, ICristalli, GFranchetti, PGrifantini, MMartelli, SLupidi, GRiva, F Adenosine deaminase inhibitors. Synthesis of deaza analogues of erythro-9-(2-hydroxy-3-nonyl)adenine. J Med Chem 27:274-8 (1984)  
Target
Name:
Adenosine deaminase
Synonyms:
ADA Adenosine aminohydrolase
Type:
Enzyme
Mol. Mass.:
40910.44
Organism:
Bos taurus (bovine)
Description:
Residue:
363
  
Inhibitor
Name:
BDBM82055
Synonyms:
3-DEAZAADENOSINE Adenosine receptor agonist, 6 | CAS_6736-58-9
Type:
Small organic molecule
Emp. Form.:
C11H14N4O4
Mol. Mass.:
266.2533
SMILES:
Nc1nccc2n(cnc12)[C@@H]1O[C@H](CO)[C@@H](O)[C@H]1O
: