Target
Adenosine deaminase
Ligand
BDBM50011575
Substrate
Meas. Tech.
ChEBML_30786
Ki
10±n/a nM
Citation
 Antonini, ICristalli, GFranchetti, PGrifantini, MMartelli, SLupidi, GRiva, F Adenosine deaminase inhibitors. Synthesis of deaza analogues of erythro-9-(2-hydroxy-3-nonyl)adenine. J Med Chem 27:274-8 (1984)  
Target
Name:
Adenosine deaminase
Synonyms:
ADA Adenosine aminohydrolase
Type:
Enzyme
Mol. Mass.:
40910.44
Organism:
Bos taurus (bovine)
Description:
Residue:
363
  
Inhibitor
Name:
BDBM50011575
Synonyms:
3-(4-Amino-imidazo[4,5-c]pyridin-1-yl)-nonan-2-ol | CHEMBL18496
Type:
Small organic molecule
Emp. Form.:
C15H24N4O
Mol. Mass.:
276.3773
SMILES:
CCCCCCC(C(C)O)n1cnc2c(N)nccc12
: