Target
Alpha-1A/Alpha-1B/Alpha-1D adrenergic receptor
Ligand
BDBM85091
Substrate
Meas. Tech.
ChEMBL_33844 (CHEMBL649281)
IC50
24000±n/a nM
Citation
 Timmermans, PBde Jonge, AThoolen, MJWilffert, BBatink, Hvan Zwieten, PA Quantitative relationships between alpha-adrenergic activity and binding affinity of alpha-adrenoceptor agonists and antagonists. J Med Chem 27:495-503 (1984)  
Target
Name:
Alpha-1A/Alpha-1B/Alpha-1D adrenergic receptor
Synonyms:
Adrenergic receptor alpha-1 alpha-1 Adrenergic Receptor
Type:
Mol. Mass.:
Description:
ASSAY_ID of EBI is 303470
Components:
This complex has 3 components.
Component 1
Name:
Alpha-1B adrenergic receptor
Synonyms:
ADA1B_RAT Alpha 1B-adrenoceptor Alpha adrenergic receptor 1A and 1B Alpha-1Adrenoceptor Alpha-1B adrenoreceptor | adrenergic Alpha1B
Type:
G Protein-Coupled Receptor (GPCR)
Mol. Mass.:
56606.71
Organism:
Rattus norvegicus (rat)
Description:
Receptor binding assays were performed using rat cortical membranes.
Residue:
515
  
Component 2
Name:
Alpha-1A adrenergic receptor
Synonyms:
ADA1A_RAT Adra1c Alpha-1A adrenoceptor Alpha-1C adrenergic receptor | adrenergic Alpha1A
Type:
Protein
Mol. Mass.:
51620.15
Organism:
Rattus norvegicus (Rat)
Description:
P43140
Residue:
466
  
Component 3
Name:
Alpha-1D adrenergic receptor
Synonyms:
ADA1D_RAT Adra1d Alpha-1D adrenergic receptor | Serotonin 1a (5-HT1a) receptor/Adrenergic receptor alpha-1
Type:
Protein
Mol. Mass.:
59375.97
Organism:
Rattus norvegicus (Rat)
Description:
P23944
Residue:
561
  
Inhibitor
Name:
BDBM85091
Synonyms:
(+/-)-2-DIPROPYLAMINO- 6,7-DIHYDROXY-1,2,3,4-TETRAHYDRONAPHTHALENE CAS_62421-17-4 dp-ADTN
Type:
Small organic molecule
Emp. Form.:
C16H25NO2
Mol. Mass.:
263.3752
SMILES:
CCCN(CCC)C1CCc2cc(O)c(O)cc2C1
: