Target
Transporter
Ligand
BDBM50452192
Substrate
Meas. Tech.
ChEBML_184434
Ki
0.950000±n/a nM
Citation
 Maryanoff, BEMcComsey, DFCastanzo, MJSetler, PEGardocki, JFShank, RPSchneider, CR Pyrroloisoquinoline antidepressants. Potent, enantioselective inhibition of tetrabenazine-induced ptosis and neuronal uptake of norepinephrine, dopamine, and serotonin. J Med Chem 27:943-6 (1984)  
Target
Name:
Transporter
Synonyms:
Monoamine transporters; Norepininephrine & dopamine | Norepinephrine Monoamine transporters
Type:
PROTEIN
Mol. Mass.:
66787.87
Organism:
Rattus norvegicus
Description:
ChEMBL_1463061
Residue:
597
  
Inhibitor
Name:
BDBM50452192
Synonyms:
CHEMBL2093945
Type:
Small organic molecule
Emp. Form.:
C19H19ClF3N
Mol. Mass.:
353.809
SMILES:
Cl.[H][C@@]12CCCN1C[C@H](c1cccc(c1)C(F)(F)F)c1ccccc21
: