Target
Transporter
Ligand
BDBM50452191
Substrate
Meas. Tech.
ChEMBL_184434 (CHEMBL789206)
Ki
65±n/a nM
Citation
 Maryanoff, BEMcComsey, DFCastanzo, MJSetler, PEGardocki, JFShank, RPSchneider, CR Pyrroloisoquinoline antidepressants. Potent, enantioselective inhibition of tetrabenazine-induced ptosis and neuronal uptake of norepinephrine, dopamine, and serotonin. J Med Chem 27:943-6 (1984)  
Target
Name:
Transporter
Synonyms:
Monoamine transporters; Norepininephrine & dopamine | Norepinephrine Monoamine transporters
Type:
PROTEIN
Mol. Mass.:
66787.87
Organism:
Rattus norvegicus
Description:
ChEMBL_1463061
Residue:
597
  
Inhibitor
Name:
BDBM50452191
Synonyms:
CHEMBL2093943
Type:
Small organic molecule
Emp. Form.:
C18H20ClN
Mol. Mass.:
285.811
SMILES:
Cl.[H][C@@]12CCCN1C[C@H](c1ccccc1)c1ccccc21
: