Target
Angiotensin-converting enzyme
Ligand
BDBM21642
Substrate
Meas. Tech.
ChEMBL_34798 (CHEMBL644414)
IC50
23±n/a nM
Citation
 Suh, JTSkiles, JWWilliams, BEYoussefyeh, RDJones, HLoev, BNeiss, ESSchwab, AMann, WSKhandwala, A Angiotensin-converting enzyme inhibitors. New orally active antihypertensive (mercaptoalkanoyl)- and [(acylthio)alkanoyl]glycine derivatives. J Med Chem 28:57-66 (1985)  
Target
Name:
Angiotensin-converting enzyme
Synonyms:
3.2.1.- ACE Angiotensin-converting enzyme, soluble form DCP1 Kininase II
Type:
Mol. Mass.:
150405.15
Organism:
Oryctolagus cuniculus
Description:
Residue:
1310
  
Inhibitor
Name:
BDBM21642
Synonyms:
(2S)-1-[(2S)-2-methyl-3-sulfanylpropanoyl]pyrrolidine-2-carboxylic acid Capozide Lopirin SQ14534 | US11491146, Compound L-Captopril
Type:
Small organic molecule
Emp. Form.:
C9H15NO3S
Mol. Mass.:
217.285
SMILES:
C[C@H](CS)C(=O)N1CCC[C@H]1C(O)=O
: