Target
Renin
Ligand
BDBM50405190
Substrate
Meas. Tech.
ChEMBL_193377 (CHEMBL798070)
pH
7.4±n/a
Ki
21.0±n/a nM
Comments
extracted
Citation
 Boger, JPayne, LSPerlow, DSLohr, NSPoe, MBlaine, EHUlm, EHSchorn, TWLaMont, BILin, TY Renin inhibitors. Syntheses of subnanomolar, competitive, transition-state analogue inhibitors containing a novel analogue of statine. J Med Chem 28:1779-90 (1986)  
Target
Name:
Renin
Synonyms:
RENI_RAT Ren1
Type:
PROTEIN
Mol. Mass.:
44272.67
Organism:
Rattus norvegicus
Description:
ChEMBL_222765
Residue:
402
  
Inhibitor
Name:
BDBM50405190
Synonyms:
CHEMBL2028991
Type:
Small organic molecule
Emp. Form.:
C57H80N12O9
Mol. Mass.:
1077.3201
SMILES:
CC(C)C[C@H](NC(=O)CC(O)[C@H](CC1CCCCC1)NC(=O)[C@H](Cc1cnc[nH]1)NC(=O)[C@H](Cc1ccccc1)NC(=O)[C@@H]1CCCN1C(=O)[C@H](Cc1cnc[nH]1)NC(=O)CC(C)C)C(=O)N[C@@H](Cc1ccccc1)C(N)=O
: