Target
Renin
Ligand
BDBM50405191
Substrate
Meas. Tech.
ChEMBL_196705 (CHEMBL801532)
Ki
6.2±n/a nM
Citation
 Boger, JPayne, LSPerlow, DSLohr, NSPoe, MBlaine, EHUlm, EHSchorn, TWLaMont, BILin, TY Renin inhibitors. Syntheses of subnanomolar, competitive, transition-state analogue inhibitors containing a novel analogue of statine. J Med Chem 28:1779-90 (1986)  
Target
Name:
Renin
Synonyms:
Angiotensinogenase RENI_HUMAN
Type:
Enzyme
Mol. Mass.:
45058.99
Organism:
Homo sapiens (Human)
Description:
Residue:
406
  
Inhibitor
Name:
BDBM50405191
Synonyms:
CHEMBL269752
Type:
Small organic molecule
Emp. Form.:
C54H77N13O9
Mol. Mass.:
1052.2709
SMILES:
CC[C@](C)(N)C(=O)N[C@@H](Cc1c[nH]cn1)C(=O)N1CCC[C@H]1C(=O)N[C@@H](Cc1ccccc1)C(=O)N[C@@H](Cc1c[nH]cn1)C(=O)NC(CC(C)C)C(O)CC(=O)N[C@@H](CC(C)C)C(=O)N[C@@H](Cc1ccccc1)C(N)=O
: