Target
Renin
Ligand
BDBM50025946
Substrate
Meas. Tech.
ChEMBL_196092 (CHEMBL872310)
IC50
3.2±n/a nM
Citation
 Boger, JPayne, LSPerlow, DSLohr, NSPoe, MBlaine, EHUlm, EHSchorn, TWLaMont, BILin, TY Renin inhibitors. Syntheses of subnanomolar, competitive, transition-state analogue inhibitors containing a novel analogue of statine. J Med Chem 28:1779-90 (1986)  
Target
Name:
Renin
Synonyms:
Angiotensinogenase RENI_HUMAN
Type:
Enzyme
Mol. Mass.:
45058.99
Organism:
Homo sapiens (Human)
Description:
Residue:
406
  
Inhibitor
Name:
BDBM50025946
Synonyms:
4-[2-(2-Acetylamino-3-phenyl-propionylamino)-3-(1H-imidazol-4-yl)-propionylamino]-5-cyclohexyl-3-hydroxy-pentanoic acid [1-(1-carbamoyl-2-phenyl-ethylcarbamoyl)-3-methyl-butyl]-amide | CHEMBL3144410
Type:
Small organic molecule
Emp. Form.:
C43H60N8O7
Mol. Mass.:
800.9859
SMILES:
CC(C)C[C@H](NC(=O)C[C@H](O)[C@H](CC1CCCCC1)NC(=O)[C@H](Cc1c[nH]cn1)NC(=O)[C@H](Cc1ccccc1)NC(C)=O)C(=O)N[C@@H](Cc1ccccc1)C(N)=O
: