Target
Histamine H2 receptor
Ligand
BDBM50026283
Substrate
Meas. Tech.
ChEBML_85684
IC50
30000±n/a nM
Citation
 Martinez, JBali, JPMagous, RLaur, JLignon, MFBriet, CNisato, DCastro, B Structure-activity relationships of C-terminal tri- and tetrapeptide fragments that inhibit gastrin activity. J Med Chem 28:273-8 (1985)  
Target
Name:
Histamine H2 receptor
Synonyms:
Gastric receptor I HISTAMINE H2 Hrh2
Type:
Enzyme Catalytic Domain
Mol. Mass.:
40269.37
Organism:
RAT
Description:
HISTAMINE H2 HRH2 RAT::P25102
Residue:
358
  
Inhibitor
Name:
BDBM50026283
Synonyms:
1-(2-{2-[2-tert-Butoxycarbonylamino-3-(1H-indol-3-yl)-propionylamino]-4-methyl-pentanoylamino}-3-carboxy-propionyl)-piperidine-2-carboxylic acid | CHEMBL2370238
Type:
Small organic molecule
Emp. Form.:
C32H45N5O9
Mol. Mass.:
643.7278
SMILES:
CC(C)C[C@H](NC(=O)[C@H](Cc1c[nH]c2ccccc12)NC(=O)OC(C)(C)C)C(=O)N[C@@H](CC(O)=O)C(=O)N1CCCC[C@H]1C(O)=O
: