Target
Histamine N-methyltransferase
Ligand
BDBM50009672
Substrate
Meas. Tech.
ChEMBL_87234 (CHEMBL696454)
Ki
18100±n/a nM
Citation
 Houston, DMMatuszewska, BBorchardt, RT Potential inhibitors of S-adenosylmethionine-dependent methyltransferases. 10. Base- and amino acid modified analogues of S-aristeromycinyl-L-homocysteine. J Med Chem 28:478-82 (1985)  
Target
Name:
Histamine N-methyltransferase
Synonyms:
HMT HNMT_HUMAN
Type:
PROTEIN
Mol. Mass.:
33287.63
Organism:
Homo sapiens (Human)
Description:
ChEMBL_87234
Residue:
292
  
Inhibitor
Name:
BDBM50009672
Synonyms:
AdoHcy S-(5'-adenosyl)-L-homocysteine S-[1-(adenin-9-yl)-1,5-dideoxy-beta-D-ribofuranos-5-yl]-L-homocysteine SAH US9175331, 1 | US9333217, S-Adenosyl-L-homocysteine (SAH)
Type:
Small organic molecule
Emp. Form.:
C14H20N6O5S
Mol. Mass.:
384.411
SMILES:
N[C@@H](CCSC[C@H]1O[C@H]([C@H](O)[C@@H]1O)n1cnc2c(N)ncnc12)C(O)=O
: