Target
Delta-type opioid receptor
Ligand
BDBM50001707
Substrate
Meas. Tech.
ChEBML_147283
Ki
50±n/a nM
Citation
 Archer, SSeyed-Mozaffari, AWard, SKosterlitz, HWPaterson, SJMcKnight, ATCorbett, AD 10-Ketonaltrexone and 10-ketooxymorphone. J Med Chem 28:974-6 (1985)  
Target
Name:
Delta-type opioid receptor
Synonyms:
D-OR-1 Delta opioid receptor OPIATE Delta OPRD1 OPRK1 | opioid receptor, delta 1
Type:
G Protein-Coupled Receptor (GPCR)
Mol. Mass.:
40382.98
Organism:
Homo sapiens (Human)
Description:
Competition binding assays were carried out using membrane preparations from transfected HN9.10 cells that constitutively expressed the delta opioid receptor.
Residue:
372
  
Inhibitor
Name:
BDBM50001707
Synonyms:
10,17-dihydroxy-4-methyl-(13R,17S)-12-oxa-4-azapentacyclo[9.6.1.01,13.05,17.07,18]octadeca-7(18),8,10-trien-14-one 10,17-dihydroxy-4-methyl-(13R,17S)-12-oxa-4-azapentacyclo[9.6.1.01,13.05,17.07,18]octadeca-7(18),8,10-trien-14-one(xymorphone) CHEMBL963 Combunox OXYMORPHONE Oxycet Percocet Roxicet Roxiprin Tylox-325
Type:
Small organic molecule
Emp. Form.:
C17H19NO4
Mol. Mass.:
301.3371
SMILES:
CN1CC[C@@]23[C@H]4Oc5c2c(C[C@@H]1[C@]3(O)CCC4=O)ccc5O
: