Target
Angiotensin-converting enzyme 2
Ligand
BDBM50367254
Substrate
Meas. Tech.
ChEBML_35979
Ki
0.500000±n/a nM
Citation
 Elliott, RLMarks, NBerg, MJPortoghese, PS Synthesis and biological evaluation of phosphonamidate peptide inhibitors of enkephalinase and angiotensin-converting enzyme. J Med Chem 28:1208-16 (1985)  
Target
Name:
Angiotensin-converting enzyme 2
Synonyms:
ACE2_RAT Angiotensin-converting enzyme-related carboxypeptidase
Type:
PROTEIN
Mol. Mass.:
92475.04
Organism:
Rattus norvegicus
Description:
ChEMBL_35979
Residue:
805
  
Inhibitor
Name:
BDBM50367254
Synonyms:
ENALAPRILAT
Type:
Small organic molecule
Emp. Form.:
C18H24N2O5
Mol. Mass.:
348.3936
SMILES:
C[C@H](N[C@@H](CCc1ccccc1)C(O)=O)C(=O)N1CCC[C@H]1C(O)=O
: