Target
D(2) dopamine receptor
Ligand
BDBM50026560
Substrate
Meas. Tech.
ChEBML_61442
IC50
6.3±n/a nM
Citation
 de Paulis, TKumar, YJohansson, LRämsby, SFlorvall, LHall, HAngeby-Möller, KOgren, SO Potential neuroleptic agents. 3. Chemistry and antidopaminergic properties of substituted 6-methoxysalicylamides. J Med Chem 28:1263-9 (1985)  
Target
Name:
D(2) dopamine receptor
Synonyms:
DOPAMINE D2 DOPAMINE D2 Short Dopamine D2 receptor Drd2
Type:
G Protein-Coupled Receptor (GPCR)
Mol. Mass.:
50931.60
Organism:
Rattus norvegicus (rat)
Description:
P61169
Residue:
444
  
Inhibitor
Name:
BDBM50026560
Synonyms:
3-Bromo-2-hydroxy-6-methoxy-N-(1-propyl-pyrrolidin-2-ylmethyl)-benzamide | CHEMBL23437
Type:
Small organic molecule
Emp. Form.:
C16H23BrN2O3
Mol. Mass.:
371.269
SMILES:
CCCN1CCC[C@H]1CNC(=O)c1c(O)c(Br)ccc1OC
: