Target
Angiotensin-converting enzyme
Ligand
BDBM50021038
Substrate
Meas. Tech.
ChEBML_36882
IC50
24±n/a nM
Citation
 Roark, WHTinney, FJCohen, DEssenburg, ADKaplan, HR Synthesis and biological activity of modified peptide inhibitors of angiotensin-converting enzyme. J Med Chem 28:1291-5 (1985)  
Target
Name:
Angiotensin-converting enzyme
Synonyms:
ACE Angiotensin converting enzyme (ACE) Angiotensin-converting enzyme, soluble form CD_antigen=CD143 DCP1 Kininase II
Type:
Enzyme
Mol. Mass.:
149709.01
Organism:
Homo sapiens (Human)
Description:
Residue:
1306
  
Inhibitor
Name:
BDBM50021038
Synonyms:
(S,S)-1-[2-(1-Ethoxycarbonyl-3-phenyl-propoxy)-propionyl]-octahydro-indole-2-carboxylic acid | CHEMBL284898
Type:
Small organic molecule
Emp. Form.:
C24H33NO6
Mol. Mass.:
431.5219
SMILES:
CCOC(=O)C(CCc1ccccc1)OC(C)C(=O)N1C2CCCCC2CC1C(O)=O
: