Target
Adenosine receptor A1
Ligand
BDBM50367271
Substrate
Meas. Tech.
ChEBML_29631
Ki
15±n/a nM
Citation
 Jacobson, KAKirk, KLPadgett, WLDaly, JW Functionalized congeners of adenosine: preparation of analogues with high affinity for A1-adenosine receptors. J Med Chem 28:1341-6 (1985)  
Target
Name:
Adenosine receptor A1
Synonyms:
AA1R_RAT ADENOSINE A1 high Adenosine A1 receptor (A1) Adenosine receptors A1 | Adora1
Type:
Protein
Mol. Mass.:
36704.13
Organism:
Rattus norvegicus (rat)
Description:
Residue:
326
  
Inhibitor
Name:
BDBM50367271
Synonyms:
CHEMBL604417
Type:
Small organic molecule
Emp. Form.:
C22H26N6O7
Mol. Mass.:
486.4778
SMILES:
CCOC(=O)CNC(=O)Cc1ccc(Nc2ncnc3n(cnc23)C2O[C@H](CO)[C@@H](O)[C@H]2O)cc1
: