Target
Adenosine receptor A1
Ligand
BDBM50367274
Substrate
Meas. Tech.
ChEBML_29631
Ki
6.7±n/a nM
Citation
 Jacobson, KAKirk, KLPadgett, WLDaly, JW Functionalized congeners of adenosine: preparation of analogues with high affinity for A1-adenosine receptors. J Med Chem 28:1341-6 (1985)  
Target
Name:
Adenosine receptor A1
Synonyms:
AA1R_RAT ADENOSINE A1 high Adenosine A1 receptor (A1) Adenosine receptors A1 | Adora1
Type:
Protein
Mol. Mass.:
36704.13
Organism:
Rattus norvegicus (rat)
Description:
Residue:
326
  
Inhibitor
Name:
BDBM50367274
Synonyms:
CHEMBL604631
Type:
Small organic molecule
Emp. Form.:
C27H29N7O6
Mol. Mass.:
547.5625
SMILES:
CNC(=O)Cc1ccc(NC(=O)Cc2ccc(Nc3ncnc4n(cnc34)C3O[C@H](CO)[C@@H](O)[C@H]3O)cc2)cc1
: