Target
Adenosine receptor A1
Ligand
BDBM50315857
Substrate
Meas. Tech.
ChEBML_29631
Ki
2.3±n/a nM
Citation
 Jacobson, KAKirk, KLPadgett, WLDaly, JW Functionalized congeners of adenosine: preparation of analogues with high affinity for A1-adenosine receptors. J Med Chem 28:1341-6 (1985)  
Target
Name:
Adenosine receptor A1
Synonyms:
AA1R_RAT ADENOSINE A1 high Adenosine A1 receptor (A1) Adenosine receptors A1 | Adora1
Type:
Protein
Mol. Mass.:
36704.13
Organism:
Rattus norvegicus (rat)
Description:
Residue:
326
  
Inhibitor
Name:
BDBM50315857
Synonyms:
(2R,3S,4R,5R)-2-(hydroxymethyl)-5-(6-(4-methoxyphenylamino)-9H-purin-9-yl)tetrahydrofuran-3,4-diol | CHEMBL1093910
Type:
Small organic molecule
Emp. Form.:
C17H19N5O5
Mol. Mass.:
373.3633
SMILES:
COc1ccc(Nc2ncnc3n(cnc23)[C@@H]2O[C@H](CO)[C@@H](O)[C@H]2O)cc1
: