Target
D(1A) dopamine receptor
Ligand
BDBM55121
Substrate
Meas. Tech.
ChEBML_58665
Ki
4400±n/a nM
Citation
 Rollema, HMastebroek, DWikström, HSvensson, KCarlsson, ASundell, S Enantiomers of 3-(3,4-dihydroxyphenyl)- and 3-(3-hydroxyphenyl)-N-n-propylpiperidine: central pre- and postsynaptic dopaminergic effects and pharmacokinetics. J Med Chem 29:1889-95 (1986)  
Target
Name:
D(1A) dopamine receptor
Synonyms:
DOPAMINE D1 Dopamine D1 high Dopamine receptor Dopamine1-like Drd1a
Type:
Enzyme Catalytic Domain
Mol. Mass.:
49429.75
Organism:
RAT
Description:
P18901
Residue:
446
  
Inhibitor
Name:
BDBM55121
Synonyms:
3-HYDROXYTYRAMINE HYDROCHLORIDE 4-(2-aminoethyl)pyrocatechol;hydrochloride Dopamine SMR000059081 | cid_65340
Type:
Small organic molecule
Emp. Form.:
C8H11NO2
Mol. Mass.:
153.1784
SMILES:
NCCc1ccc(O)c(O)c1
: