Target
Aldo-keto reductase family 1 member B1
Ligand
BDBM16415
Substrate
Meas. Tech.
ChEBML_31924
IC50
1500±n/a nM
Citation
 DeRuiter, JBrubaker, ANWhitmer, WLStein, JL Synthesis and aldose reductase inhibitory activity of substituted 2-oxoquinoline-1-acetic acid derivatives. J Med Chem 29:2024-8 (1986)  
Target
Name:
Aldo-keto reductase family 1 member B1
Synonyms:
ALDR_RAT Akr1b4 Aldr1
Type:
PROTEIN
Mol. Mass.:
35797.87
Organism:
Rattus norvegicus
Description:
ChEMBL_1512484
Residue:
316
  
Inhibitor
Name:
BDBM16415
Synonyms:
(1,3-dioxo-1H-benzo[de]isoquinolin-2(3H)-yl)acetic acid Alrestatin PiG Tocris-0485
Type:
Small organic molecule
Emp. Form.:
C14H9NO4
Mol. Mass.:
255.2256
SMILES:
OC(=O)CN1C(=O)c2cccc3cccc(C1=O)c23
: