Target
Aldo-keto reductase family 1 member B1
Ligand
BDBM50049730
Substrate
Meas. Tech.
ChEBML_31924
IC50
10±n/a nM
Citation
 DeRuiter, JBrubaker, ANWhitmer, WLStein, JL Synthesis and aldose reductase inhibitory activity of substituted 2-oxoquinoline-1-acetic acid derivatives. J Med Chem 29:2024-8 (1986)  
Target
Name:
Aldo-keto reductase family 1 member B1
Synonyms:
ALDR_RAT Akr1b4 Aldr1
Type:
PROTEIN
Mol. Mass.:
35797.87
Organism:
Rattus norvegicus
Description:
ChEMBL_1512484
Residue:
316
  
Inhibitor
Name:
BDBM50049730
Synonyms:
2-(5-(2-methyl-3-phenylallylidene)-4-oxo-2-thioxothiazolidin-3-yl)acetic acid Epalrestat | {5-[(E)-2-Methyl-3-phenyl-prop-2-en-(Z)-ylidene]-4-oxo-2-thioxo-thiazolidin-3-yl}-acetic acid
Type:
Small organic molecule
Emp. Form.:
C15H13NO3S2
Mol. Mass.:
319.399
SMILES:
C\C(\C=C1/SC(=S)N(CC(O)=O)C1=O)=C/c1ccccc1
: