Target
Renin
Ligand
BDBM50024153
Substrate
Meas. Tech.
ChEBML_195744
IC50
190±n/a nM
Citation
 Thaisrivongs, SPals, DTHarris, DWKati, WMTurner, SR Design and synthesis of a potent and specific renin inhibitor with a prolonged duration of action in vivo. J Med Chem 29:2088-93 (1986)  
Target
Name:
Renin
Synonyms:
Angiotensinogenase RENI_HUMAN
Type:
Enzyme
Mol. Mass.:
45058.99
Organism:
Homo sapiens (Human)
Description:
Residue:
406
  
Inhibitor
Name:
BDBM50024153
Synonyms:
2-(1-{[1-[1-(1-Hydroxy-2-{2-methyl-1-[(pyridin-2-ylmethyl)-carbamoyl]-butylcarbamoyl}-ethyl)-3-methyl-butylcarbamoyl]-2-(3H-imidazol-4-yl)-ethyl]-methyl-carbamoyl}-2-phenyl-ethylcarbamoyl)-pyrrolidine-1-carboxylic acid tert-butyl ester | CHEMBL3142177
Type:
Small organic molecule
Emp. Form.:
C46H67N9O8
Mol. Mass.:
874.0797
SMILES:
CC[C@H](C)[C@H](NC(=O)C[C@H](O)[C@H](CC(C)C)NC(=O)[C@H](Cc1c[nH]cn1)N(C)C(=O)[C@H](Cc1ccccc1)NC(=O)[C@@H]1CCCN1C(=O)OC(C)(C)C)C(=O)NCc1ccccn1
: