Target
Angiotensin-converting enzyme
Ligand
BDBM50367254
Substrate
Meas. Tech.
ChEBML_35994
IC50
1.2±n/a nM
Citation
 Thorsett, EDHarris, EEAster, SDPeterson, ERSnyder, JPSpringer, JPHirshfield, JTristram, EWPatchett, AAUlm, EH Conformationally restricted inhibitors of angiotensin converting enzyme: synthesis and computations. J Med Chem 29:251-60 (1986)  
Target
Name:
Angiotensin-converting enzyme
Synonyms:
ACE Angiotensin converting enzyme (ACE) Angiotensin-converting enzyme, soluble form CD_antigen=CD143 DCP1 Kininase II
Type:
Enzyme
Mol. Mass.:
149709.01
Organism:
Homo sapiens (Human)
Description:
Residue:
1306
  
Inhibitor
Name:
BDBM50367254
Synonyms:
ENALAPRILAT
Type:
Small organic molecule
Emp. Form.:
C18H24N2O5
Mol. Mass.:
348.3936
SMILES:
C[C@H](N[C@@H](CCc1ccccc1)C(O)=O)C(=O)N1CCC[C@H]1C(O)=O
: