Target
D(2) dopamine receptor
Ligand
BDBM50367319
Substrate
Meas. Tech.
ChEBML_58478
IC50
49±n/a nM
Citation
 Yevich, JPNew, JSSmith, DWLobeck, WGCatt, JDMinielli, JLEison, MSTaylor, DPRiblet, LATemple, DL Synthesis and biological evaluation of 1-(1,2-benzisothiazol-3-yl)- and (1,2-benzisoxazol-3-yl)piperazine derivatives as potential antipsychotic agents. J Med Chem 29:359-69 (1986)  
Target
Name:
D(2) dopamine receptor
Synonyms:
DOPAMINE D2 DOPAMINE D2 Short Dopamine D2 receptor Drd2
Type:
G Protein-Coupled Receptor (GPCR)
Mol. Mass.:
50931.60
Organism:
Rattus norvegicus (rat)
Description:
P61169
Residue:
444
  
Inhibitor
Name:
BDBM50367319
Synonyms:
CHEMBL1203225
Type:
Small organic molecule
Emp. Form.:
C24H34N4O2S
Mol. Mass.:
442.617
SMILES:
CCC1(CC)CC(=O)N(CCCCN2CCN(CC2)c2nsc3ccccc23)C(=O)C1
: