Target
Mu-type opioid receptor
Ligand
BDBM50021322
Substrate
Meas. Tech.
ChEMBL_139015 (CHEMBL744611)
Kd
6.2±n/a nM
Citation
 Cheng, AUyeno, EPolgar, WToll, LLawson, JADeGraw, JILoew, GCamerman, ACamerman, N N-substituent modulation of opiate agonist/antagonist activity in resolved 3-methyl-3-(m-hydroxyphenyl)piperidines. J Med Chem 29:531-7 (1986)  
Target
Name:
Mu-type opioid receptor
Synonyms:
MOR-1 Mu-type opioid receptor (MOR) OPRM_RAT Opioid receptor B Ror-b
Type:
G Protein-Coupled Receptor (GPCR)
Mol. Mass.:
44503.11
Organism:
Rattus norvegicus (rat)
Description:
Competition binding assays were carried out using membrane preparations from transfected HN9.10 cells that constitutively expressed the mu opioid receptor.
Residue:
398
  
Inhibitor
Name:
BDBM50021322
Synonyms:
3-(3-Methyl-1-phenethyl-piperidin-3-yl)-phenol CHEMBL150967
Type:
Small organic molecule
Emp. Form.:
C20H25NO
Mol. Mass.:
295.4186
SMILES:
CC1(CCCN(CCc2ccccc2)C1)c1cccc(O)c1
: