Target
Mu-type opioid receptor
Ligand
BDBM50021327
Substrate
Meas. Tech.
ChEMBL_148713 (CHEMBL857613)
Kd
132±n/a nM
Citation
 Cheng, AUyeno, EPolgar, WToll, LLawson, JADeGraw, JILoew, GCamerman, ACamerman, N N-substituent modulation of opiate agonist/antagonist activity in resolved 3-methyl-3-(m-hydroxyphenyl)piperidines. J Med Chem 29:531-7 (1986)  
Target
Name:
Mu-type opioid receptor
Synonyms:
MOR-1 Mu-type opioid receptor (MOR) OPRM_RAT Opioid receptor B Ror-b
Type:
G Protein-Coupled Receptor (GPCR)
Mol. Mass.:
44503.11
Organism:
Rattus norvegicus (rat)
Description:
Competition binding assays were carried out using membrane preparations from transfected HN9.10 cells that constitutively expressed the mu opioid receptor.
Residue:
398
  
Inhibitor
Name:
BDBM50021327
Synonyms:
3-(1,3-Dimethyl-piperidin-3-yl)-phenol CHEMBL359154
Type:
Small organic molecule
Emp. Form.:
C13H19NO
Mol. Mass.:
205.2961
SMILES:
CN1CCCC(C)(C1)c1cccc(O)c1
: